{"text_format":"1","workbook":"xlsx","n_sheets":10,"sheets":["INPUT","SUMMARY","BMP INPUT","Outlet Calculations","PRE vs POST Calculations","Restricted Outlet Calculations","BMP Volume Calculations","REF_Curve Numbers","REF_Runoff Coefficients","REF_Time of Concentration"],"not_rendered":{"charts":0,"images":1,"macros":1,"external_links":0,"defined_names":0,"comments":0,"pivot_tables":0},"unopened":[],"bounds":{"document_bytes":16777216,"sheet_cells":100000,"rows_first":2000,"rows_last":500,"rows_between":2000,"halvings":0,"cell_chars":16384,"cell_head_chars":4096},"cells_cut":0,"cells_raw":0,"read":"whole","date_system":"1900"}

{"sheet":"INPUT","index":0,"n_rows":64,"n_cols":9,"rows_kept":64,"cut":false,"hidden":false,"merged":[[63,1,63,6],[48,1,48,6],[20,5,21,5],[20,6,21,6],[3,2,3,7],[51,3,52,3],[51,5,52,5],[24,1,25,1],[32,2,33,2],[26,3,26,4],[27,3,27,4],[28,3,28,4],[29,3,29,4],[30,3,30,4],[31,3,31,4],[24,3,24,4],[11,1,11,8],[12,8,13,8],[12,6,13,6],[19,3,19,4],[14,3,14,4],[15,3,15,4],[16,3,16,4],[17,3,17,4],[18,3,18,4],[6,1,6,3],[12,7,13,7],[0,1,0,8],[32,3,33,4],[20,3,21,4],[20,8,21,8],[20,7,21,7],[13,3,13,4],[12,3,12,4],[7,1,7,2],[8,1,8,2],[9,1,9,2],[20,2,21,2],[2,1,2,7],[4,2,4,7],[12,1,13,1],[36,5,37,5],[36,3,37,3],[23,1,23,8],[24,6,25,6],[24,8,25,8],[32,5,33,5],[32,6,33,6],[32,7,33,7],[32,8,33,8],[25,3,25,4],[24,7,25,7]]}
[null,"Proposed Stormwater Calculation Tool - Calhoun County Stormwater Management TRM"]
[]
[null,"Stormwater Management Requirements"]
[null,"Site Name:","Example 20-acre Commercial Development"]
[null,"Outlet ID:"]
[]
[null,"If Restricted Outflow Rate is required by Reviewing Agency:"]
[null,"25-Year Allowable Peak Discharge*:",null,2,"cfs"]
[]
[]
[]
[null,"PRE-DEVELOPMENT CONDITIONS"]
[null,"Sub-Drainage District ID","Area","Description/Hydrologic Group",null,"Runoff Coefficient (C)","A*C","Curve Number (CN)","A*CN"]
[null,null,"(acres)"," (select from list)"]
[null,1,20,"Row Crops (Type B)",null,{"$f":"IFERROR(VLOOKUP(D15,'REF_Runoff Coefficients'!$A$2:$B$43,2,FALSE),\"\")","v":0.2},{"$f":"IFERROR(C15*F15,0)","v":4},{"$f":"IFERROR(VLOOKUP(D15,'REF_Curve Numbers'!$A$2:$B$43,2,FALSE),\"\")","v":75},{"$f":"IFERROR(C15*H15,0)","v":1500}]
{"$rows_left_out":50}
{"sheet":"SUMMARY","index":1,"n_rows":20,"n_cols":4,"rows_kept":20,"cut":false,"hidden":false,"merged":[[1,1,1,2],[15,3,16,3]]}
[]
[null,"Summary"]
[null,"Outlet ID",{"$f":"INPUT!C5","v":0},"Notes"]
[null,"Total Acreage (ac)",{"$f":"INPUT!C33","v":20}]
[null,"Weighted C - Proposed Conditions",{"$f":"IFERROR(INPUT!G33,0)","v":0.72499999999999998}]
[null,"Weighted CN - Proposed Conditions",{"$f":"IFERROR(INPUT!I33,0)","v":88.75}]
[null,"Time of Concentration PRE (hr)",{"$f":"INPUT!H49","v":0.37737374814043551}]
[null,"Time of Concentration POST (hr)",{"$f":"INPUT!H64","v":0.28023478509067845}]
[null,"Water Quality (WQ) Volume (ft3)",{"$f":"IFERROR('PRE vs POST Calculations'!H4,0)","v":52635},"Volume from 1 inch of rainfall"]
[null,"Channel Protection (CP) Volume (ft3)",{"$f":"'PRE vs POST Calculations'!K30","v":77855.75784945066},"2-yr / 24-hr rainfall event (volume difference between pre-development and post-development"]
[null,"Infiltration Volume (ft3) - Required",{"$f":"IFERROR('PRE vs POST Calculations'!L37,0)","v":77855.75784945066},"Larger of the WQ volume and CP volume"]
[null,"Infiltration Volume (ft3) - Provided",{"$f":"'BMP Volume Calculations'!J20","v":77657.5},"Computed from the \"BMP INPUT\" worksheet"]
[null,"25-Year Peak Allowable Discharge (cfs)",{"$f":"IFERROR(IF(INPUT!D8=\"\",'PRE vs POST Calculations'!W85,INPUT!D8),0)","v":2}]
[null,"25-Year Flood Protection (FP) Volume (ft3)",{"$f":"'PRE vs POST Calculations'!AS29","v":101579.52846974303}]
[]
{"$rows_left_out":6}
{"sheet":"BMP INPUT","index":2,"n_rows":45,"n_cols":14,"rows_kept":45,"cut":false,"hidden":false,"merged":[[1,4,1,5],[8,4,8,5],[15,4,15,5],[17,10,17,11],[7,13,7,14],[13,13,13,14],[1,7,1,8],[8,7,8,8],[15,7,15,8],[1,10,1,11],[1,13,1,14],[9,10,9,11],[38,1,38,2],[1,1,1,2],[8,1,8,2],[16,1,16,2],[23,1,23,2],[31,1,31,2]]}
[]
[null,"Bioretention/Rain Garden/Infiltration Basin #1",null,null,"Porous Pavement #1",null,null,"Dry Well #1",null,null,"Bioswale #1",null,null,"Other #1"]
[null,"Avg Design Infiltration Rate (in/hr)",0.6,null,"Avg Design Infiltration Rate (in/hr)",null,null,"Avg Design Infiltration Rate (in/hr)",null,null,"Avg Design Infiltration Rate (in/hr)",null,null,"Type of BMP"]
[null,"Area of Bioretention Ponding at Max. Depth (ft2)",12000,null,"Average Bed Area (ft2)",null,null,"Average Bed Area (ft2)",null,null,"Length of Swale Per Check Dam (ft)",null,null,"Avg Design Infiltration Rate (in/hr)"]
[null,"Area of Bioretention at Bottom (ft2)",11000,null,"Maximum Water Depth (ft)",null,null,"Maximum Water Depth (ft)",null,null,"Depth of Check Dam (ft)",null,null,"Bed Area (ft2)"]
[null,"Maximum Ponding Depth (ft)",1,null,"Void Ratio (0.30 max)",null,null,"Void Ratio",0.3,null,"Top Width of Check Dam (ft)",null,null,"Storage Volume (ft3)"]
[null,"BMP Area (ft2)",{"$f":"(C4+C5)/2","v":11500},null,"Storage Volume (ft3)",{"$f":"IF(F6>0.3,F4*F5*0.3,F4*F5*F6)","v":0},null,"Storage Volume (ft3)",{"$f":"I4*I5*I6","v":0},null,"Bottom Width of Check Dam (ft)"]
[null,"Surface Storage Volume (ft3)",{"$f":"IFERROR(AVERAGE(C4:C5)*C6,0)","v":11500},null,null,null,null,null,null,null,"Storage Volume (ft3)",{"$f":"0.5*L4*L5*(L6+L7)/2","v":0},null,"Other #2"]
[null,null,null,null,"Porous Pavement #2",null,null,"Dry Well #2",null,null,null,null,null,"Type of BMP"]
[null,"Area of engineered soil media (ft)",11000,null,"Avg Design Infiltration Rate (in/hr)",null,null,"Avg Design Infiltration Rate (in/hr)",null,null,"Bioswale #2",null,null,"Avg Design Infiltration Rate (in/hr)"]
[null,"Depth of engineered soil media (ft)",3,null,"Average Bed Area (ft2)",null,null,"Average Bed Area (ft2)",null,null,"Avg Design Infiltration Rate (in/hr)",null,null,"Bed Area (ft2)"]
[null,"Void Ratio (max 0.30)",0.3,null,"Maximum Water Depth (ft)",null,null,"Maximum Water Depth (ft)",null,null,"Length of Swale Per Check Dam (ft)",null,null,"Storage Volume (ft3)"]
[null,"Soil Storage Volume (ft3)",{"$f":"IF(C12>0.3,C10*C11*0.3,C10*C11*C12)","v":9900},null,"Void Ratio (0.30 max)",null,null,"Void Ratio",0.3,null,"Depth of Check Dam (ft)"]
[null,"TOTAL STORAGE VOLUME (ft3)",{"$f":"C8+C13","v":21400},null,"Storage Volume (ft3)",{"$f":"IF(F13>0.3,F11*F12*0.3,F11*F12*F13)","v":0},null,"Storage Volume (ft3)",{"$f":"I11*I12*I13","v":0},null,"Top Width of Check Dam (ft)",null,null,"Other #3"]
[null,"TOTAL VOLUME: STORAGE + ACTIVE INFILTRATION",{"$f":"(C7/12*C3*6)+C14","v":24850},null,null,null,null,null,null,null,"Bottom Width of Check Dam (ft)",null,null,"Type of BMP"]
{"$rows_left_out":31}
{"sheet":"Outlet Calculations","index":3,"n_rows":58,"n_cols":15,"rows_kept":58,"cut":false,"hidden":false,"merged":[[48,7,48,8],[52,7,52,8],[53,7,53,8],[54,7,54,8],[30,8,31,9],[36,7,36,10],[39,7,39,8],[40,7,40,8],[47,7,47,10],[41,7,41,8],[23,7,23,10],[23,2,23,5],[39,2,39,3],[40,2,40,3],[1,13,1,14],[24,2,24,3],[24,7,24,8],[27,2,27,3],[28,2,28,3],[28,7,28,8],[41,2,41,3],[37,2,37,3],[36,2,36,5],[27,7,27,8],[30,3,31,4]]}
[]
[null,null,null,null,null,null,null,null,null,null,null,null,null,"For Interpolation                                                      "]
[null,null,"Elevation","Contour","Storage","Total ",null,null,null,null,null,null,null,"Total ","Elevation"]
[null,null,"Contour","Area","Volume","Volume",null,null,null,null,null,null,null,"Volume","Contour"]
[null,null,"(feet)","(Sq. ft)","(Cu. ft.)","(Cu. Ft.)",null,null,null,null,null,null,null,"(Cu. Ft.)","(feet)"]
[null,"(lowest)",893,8273,0,0,null,null,null,null,null,null,null,{"$f":"F6","v":0},{"$f":"IF(C6=0,\"-\",C6)","v":893}]
[null,null,894,9400,{"$f":"IF(D7=0,\"-\",(D6+D7+(D6*D7)^0.5)*((C7-C6)/3))","v":8830.5048713837641},{"$f":"IF(E7=\"-\",\"-\",E7+E6)","v":8830.5048713837641},null,null,null,null,null,null,null,8830.5048713837641,894]
[null,null,895,10600,9993.9945902580748,{"$f":"IF(E8=\"-\",\"-\",E8+E7)","v":18824.499461641841},null,null,null,null,null,null,null,18824.499461641841,895]
[null,null,896,11871,11229.504364457745,21223.498954715818,null,null,null,null,null,null,null,21223.498954715818,896]
[null,null,null,null,"-","-",null,null,null,null,null,null,null,"-","-"]
[null,null,null,null,"-","-",null,null,null,null,null,null,null,"-","-"]
[null,null,null,null,"-","-",null,null,null,null,null,null,null,"-","-"]
[null,null,null,null,"-","-",null,null,null,null,null,null,null,"-","-"]
[null,null,null,null,"-","-",null,null,null,null,null,null,null,"-","-"]
[null,null,null,null,"-","-",null,null,null,null,null,null,null,"-","-"]
{"$rows_left_out":44}
{"sheet":"PRE vs POST Calculations","index":4,"n_rows":92,"n_cols":47,"rows_kept":92,"cut":false,"hidden":false,"merged":[[1,1,1,7],[1,9,1,15],[2,10,2,15],[3,10,3,15],[4,10,4,15],[36,9,36,10],[1,32,1,38],[2,33,2,38],[3,17,3,21],[3,33,3,38],[4,33,4,38],[7,9,8,9],[7,12,8,12],[7,13,8,13],[18,9,18,15],[19,9,20,9],[19,12,20,12],[19,13,20,13],[6,9,6,15],[13,17,13,18],[29,10,29,11],[34,10,34,11],[5,17,5,18],[6,32,6,38],[7,32,8,32],[7,35,8,35],[7,36,8,36],[17,32,17,38],[18,32,19,32],[18,35,19,35],[18,36,19,36],[26,17,26,18],[7,24,8,24],[7,27,8,27],[30,36,30,37],[6,24,6,30],[7,28,8,28],[1,24,1,30],[2,25,2,30],[3,25,3,30],[31,9,32,15],[33,10,33,11],[4,25,4,30],[17,24,17,30],[18,24,19,24],[18,27,19,27],[18,28,19,28],[30,17,30,18],[7,40,8,40],[7,43,8,43],[7,44,8,44],[17,40,17,46],[18,40,19,40],[18,43,19,43],[18,44,19,44],[1,40,1,46],[2,41,2,46],[3,41,3,46],[4,41,4,46],[6,40,6,46],[28,36,28,37],[28,28,28,29],[30,28,30,29],[28,44,28,45],[30,44,30,45]]}
[]
[null,"Water Quality Treatment Volume",null,null,null,null,null,null,null,"Channel Protection Volume",null,null,null,null,null,null,null,null,null,null,null,null,null,null,"Flood Protection Volume: 10-yr",null,null,null,null,null,null,null,"Flood Protection Volume: 100-yr",null,null,null,null,null,null,null,"Flood Protection Volume: 25-yr"]
[null,8.3333333333333329E-2,"*","Total Site Area (A) (Ft2)","*","Weighted C","=","VWQ (ft3)",null,"Site Name:",{"$f":"INPUT!C4","v":"Example 20-acre Commercial Development"},null,null,null,null,null,null,null,null,null,null,null,null,null,"Site Name:",{"$f":"K3","v":"Example 20-acre Commercial Development"},null,null,null,null,null,null,"Site Name:",{"$f":"K3","v":"Example 20-acre Commercial Development"},null,null,null,null,null,null,"Site Name:",{"$f":"K3","v":"Example 20-acre Commercial Development"}]
[null,8.3333333333333329E-2,"*",{"$f":"INPUT!C33*43560","v":871200},"*",{"$f":"INPUT!G33","v":0.72499999999999998},"=",{"$f":"B4*D4*F4","v":52635},null,"Total Site Area (acres)",{"$f":"INPUT!D9","v":0},null,null,null,null,null,null,"To Calculate the Existing and Proposed Peak Stormwater Runoff Rate",null,null,null,null,null,null,"Total Site Area (acres):",{"$f":"K4","v":0},null,null,null,null,null,null,"Total Site Area (acres):",{"$f":"K4","v":0},null,null,null,null,null,null,"Total Site Area (acres):",{"$f":"K4","v":0}]
[null,null,null,null,null,null,null,null,null,"2-Year, 24-Hour Rainfall:",2.38,null,null,null,null,null,null,null,null,null,null,null,null,null,"10-Year, 24-Hour Rainfall:",{"$f":"S9","v":3.56},null,null,null,null,null,null,"100-Year, 24-Hour Rainfall:",{"$f":"S10","v":5.71},null,null,null,null,null,null,"25-Year, 24-Hour Rainfall:",{"$f":"S11","v":4.33}]
[null,null,null,null,null,null,null,null,null,null,null,null,null,null,null,null,null,"PRECIPITATION"]
[null,null,null,null,null,null,null,null,null,"Pre-development Conditions",null,null,null,null,null,null,null,"Frequency","Rainfall (P) (in)",null,null,null,null,null,"Pre-development Conditions",null,null,null,null,null,null,null,"Pre-development Conditions",null,null,null,null,null,null,null,"Pre-development Conditions"]
[null,null,null,null,null,null,null,null,null,"Cover Type/Soil Type","Area","Area","CN","S","Q Runoff1","Runoff Volume2",null,"2-yr, 24 hr",2.54,null,null,null,null,null,"Cover Type/Soil Type","Area","Area","CN","S","Q Runoff","Runoff Volume",null,"Cover Type/Soil Type","Area","Area","CN","S","Q Runoff","Runoff Volume",null,"Cover Type/Soil Type","Area","Area","CN","S","Q Runoff","Runoff Volume"]
[null,null,null,null,null,null,null,null,null,null,"(sf)","(ac)",null,null,"(in)","(ft3)",null,"10-yr, 24 hr",3.56,null,null,null,null,null,null,"(sf)","(ac)",null,null,"(in)","(ft3)",null,null,"(sf)","(ac)",null,null,"(in)","(ft3)",null,null,"(sf)","(ac)",null,null,"(in)","(ft3)"]
[null,null,null,null,null,null,null,null,null,{"$f":"INPUT!D15","v":"Row Crops (Type B)"},{"$f":"L10*43560","v":871200},{"$f":"INPUT!C15","v":20},{"$f":"INPUT!H15","v":75},{"$f":"IFERROR(1000/M10-10,\"\")","v":3.3333333333333339},{"$f":"IFERROR((($K$5-0.2*N10)^2)/($K$5+0.8*N10),\"\")","v":0.58167327168648142},{"$f":"IFERROR(O10/12*K10, 0)","v":42229.479524438553},null,"100-yr, 24 hr",5.71,null,null,null,null,null,{"$f":"J10","v":"Row Crops (Type B)"},{"$f":"AA10*43560","v":871200},{"$f":"L10","v":20},{"$f":"M10","v":75},{"$f":"IFERROR(1000/AB10-10,\"\")","v":3.3333333333333339},{"$f":"IFERROR((($Z$5-0.2*AC10)^2)/($Z$5+0.8*AC10),\"\")","v":1.344439685938615},{"$f":"IFERROR(AD10/12*Z10, 0)","v":97606.321199143451},null,{"$f":"J10","v":"Row Crops (Type B)"},{"$f":"AI10*43560","v":871200},{"$f":"L10","v":20},{"$f":"M10","v":75},{"$f":"IFERROR(1000/AJ10-10,\"\")","v":3.3333333333333339},{"$f":"IFERROR((($AH$5-0.2*AK10)^2)/($AH$5+0.8*AK10),\"\")","v":3.0364358668258387},{"$f":"IFERROR(AL10/12*AH10, 0)","v":220445.24393155589},null,{"$f":"J10","v":"Row Crops (Type B)"},{"$f":"AQ10*43560","v":871200},{"$f":"L10","v":20},{"$f":"M10","v":75},{"$f":"IFERROR(1000/AR10-10,\"\")","v":3.3333333333333339},{"$f":"IFERROR((($AP$5-0.2*AS10)^2)/($AP$5+0.8*AS10),\"\")","v":1.9180578053041126},{"$f":"IFERROR(AT10/12*AP10, 0)","v":139250.99666507856}]
[null,null,null,null,null,null,null,null,null,{"$f":"INPUT!D16","v":0},{"$f":"L11*43560","v":0},{"$f":"INPUT!C16","v":0},{"$f":"INPUT!H16","v":""},{"$f":"IFERROR(1000/M11-10,\"\")","v":""},{"$f":"IFERROR((($K$5-0.2*N11)^2)/($K$5+0.8*N11),\"\")","v":""},{"$f":"IFERROR(O11/12*K11, 0)","v":0},null,"25-yr, 24 hr",4.33,null,null,null,null,null,{"$f":"J11","v":0},{"$f":"AA11*43560","v":0},{"$f":"L11","v":0},{"$f":"M11","v":""},{"$f":"IFERROR(1000/AB11-10,\"\")","v":""},{"$f":"IFERROR((($Z$5-0.2*AC11)^2)/($Z$5+0.8*AC11),\"\")","v":""},{"$f":"IFERROR(AD11/12*Z11, 0)","v":0},null,{"$f":"J11","v":0},{"$f":"AI11*43560","v":0},{"$f":"L11","v":0},{"$f":"M11","v":""},{"$f":"IFERROR(1000/AJ11-10,\"\")","v":""},{"$f":"IFERROR((($AH$5-0.2*AK11)^2)/($AH$5+0.8*AK11),\"\")","v":""},{"$f":"IFERROR(AL11/12*AH11, 0)","v":0},null,{"$f":"J11","v":0},{"$f":"AQ11*43560","v":0},{"$f":"L11","v":0},{"$f":"M11","v":""},{"$f":"IFERROR(1000/AR11-10,\"\")","v":""},{"$f":"IFERROR((($AP$5-0.2*AS11)^2)/($AP$5+0.8*AS11),\"\")","v":""},{"$f":"IFERROR(AT11/12*AP11, 0)","v":0}]
[null,null,null,null,null,null,null,null,null,{"$f":"INPUT!D17","v":0},0,{"$f":"INPUT!C17","v":0},{"$f":"INPUT!H17","v":""},"","",0,null,null,null,null,null,null,null,null,0,0,0,"","","",0,null,0,0,0,"","","",0,null,0,0,0,"","","",0]
[null,null,null,null,null,null,null,null,null,{"$f":"INPUT!D18","v":0},0,{"$f":"INPUT!C18","v":0},{"$f":"INPUT!H18","v":""},"","",0,null,null,null,null,null,null,null,null,0,0,0,"","","",0,null,0,0,0,"","","",0,null,0,0,0,"","","",0]
[null,null,null,null,null,null,null,null,null,{"$f":"INPUT!D19","v":0},0,{"$f":"INPUT!C19","v":0},{"$f":"INPUT!H19","v":""},"","",0,null,"MAXIMUM RETENTION (S-in)",null,null,null,null,null,null,0,0,0,"","","",0,null,0,0,0,"","","",0,null,0,0,0,"","","",0]
[null,null,null,null,null,null,null,null,null,{"$f":"INPUT!D20","v":0},0,{"$f":"INPUT!C20","v":0},{"$f":"INPUT!H20","v":""},"","",0,null,"Pre-Development",{"$f":"MIN(IFERROR((1000/INPUT!I21)-10,0),15)","v":3.3333333333333339},null,null,null,null,null,0,0,0,"","","",0,null,0,0,0,"","","",0,null,0,0,0,"","","",0]
{"$rows_left_out":78}
{"sheet":"Restricted Outlet Calculations","index":5,"n_rows":23,"n_cols":7,"rows_kept":23,"cut":false,"hidden":false,"merged":[[17,0,17,3]]}
[]
[]
["Restricted Outflow Discharge (qo)",{"$f":"IF(INPUT!D8=\"\",\"N/A\",INPUT!D8)","v":2},"cfs"]
["25-yr Peak Inflow Discharge (qi)",{"$f":"'PRE vs POST Calculations'!W92","v":67.693995788640962},"cfs"]
["Qo / Qi RATIO",{"$f":"B3/B4","v":2.954471776558357E-2}]
["vs / vr RATIO",{"$f":"-0.142*LN(B5)+0.2062","v":0.70630274358357292}]
[]
["25-yr Post-Development Runoff Volume (vr)",{"$f":"'PRE vs POST Calculations'!AU27","v":240830.5251348216},"cubic feet"]
["25-yr Storage Volume for Flood Control (vs)",{"$f":"IF(B5<0.01,B8,(ROUND((-0.142*LN(B5)+0.2062)*B8,-3)))","v":170000},"cubic feet"]
[]
["Notes for Designers:"]
["1. When qo/qi is at 0.01 or below, store entire 100-yr runoff volume (vr)"]
["2. Designers may use hydrologic/hydraulic routing models to confirm exact storage volume needed"]
["3. vs / vr ratio = [ -.142 * ln(Qo/Qi) + 0.2062 ]"]
["4. Required volume (vs) =  vs / vr ratio * vr"]
{"$rows_left_out":9}
{"sheet":"BMP Volume Calculations","index":6,"n_rows":20,"n_cols":10,"rows_kept":20,"cut":false,"hidden":false,"merged":[[2,8,3,8],[1,1,1,9],[19,1,19,8],[12,1,12,2],[2,1,3,3],[2,4,3,4],[2,5,3,5],[4,1,4,2],[5,1,5,2],[6,1,6,2],[13,1,13,2],[14,1,14,2],[15,1,15,2],[7,1,7,2],[8,1,8,2],[9,1,9,2],[10,1,10,2],[11,1,11,2],[2,6,3,6],[2,7,3,7]]}
[]
[null,"BMP INFILTRATION VOLUME"]
[null,"Proposed BMP",null,null,"BMP Area (ft2)","Storage Volume (ft3)","Infiltration Period (hrs)","Avg Design Infiltraton Rate (in/hr)","Infiltration Volume (ft3)","Total BMP Volume (ft3)"]
[null,null,null,null,null,null,null,null,null,"(Storage Volume + Infiltration Volume)"]
[null,"Bioretention/Rain Garden",null,"#1",{"$f":"'BMP INPUT'!C7","v":11500},{"$f":"'BMP INPUT'!C14","v":21400},6,{"$f":"IF('BMP INPUT'!C3<0.4,0.4,'BMP INPUT'!C3)","v":0.6},{"$f":"E5/12*G5*H5","v":3450},{"$f":"F5+I5","v":24850}]
[null,"Bioretention/Rain Garden",null,"#2",{"$f":"'BMP INPUT'!C22","v":10050},{"$f":"'BMP INPUT'!C29","v":18690},6,{"$f":"IF('BMP INPUT'!C18<0.4,0.4,'BMP INPUT'!C18)","v":0.7},{"$f":"E6/12*G6*H6","v":3517.5},{"$f":"F6+I6","v":22207.5}]
[null,"Bioretention/Rain Garden",null,"#3",{"$f":"'BMP INPUT'!C37","v":8600},{"$f":"'BMP INPUT'!C44","v":20280},6,{"$f":"IF('BMP INPUT'!C33<0.4,0.4,'BMP INPUT'!C33)","v":2.4},10320,30600]
[null,"Porous Pavement",null,"#1",{"$f":"'BMP INPUT'!F4","v":0},{"$f":"'BMP INPUT'!F7","v":0},6,{"$f":"IF('BMP INPUT'!F3<0.4,0.4,'BMP INPUT'!F3)","v":0.4},0,0]
[null,"Porous Pavement",null,"#2",{"$f":"'BMP INPUT'!F11","v":0},{"$f":"'BMP INPUT'!F14","v":0},6,{"$f":"IF('BMP INPUT'!F10<0.4,0.4,'BMP INPUT'!F10)","v":0.4},0,0]
[null,"Porous Pavement",null,"#3",{"$f":"'BMP INPUT'!F18","v":0},{"$f":"'BMP INPUT'!F21","v":0},6,{"$f":"IF('BMP INPUT'!F17<0.4,0.4,'BMP INPUT'!F17)","v":0.4},0,0]
[null,"Dry Well",null,"#1",{"$f":"'BMP INPUT'!I4","v":0},{"$f":"'BMP INPUT'!I7","v":0},6,{"$f":"IF('BMP INPUT'!I3<0.4,0.4,'BMP INPUT'!I3)","v":0.4},0,0]
[null,"Dry Well",null,"#2",{"$f":"'BMP INPUT'!I11","v":0},{"$f":"'BMP INPUT'!I14","v":0},6,{"$f":"IF('BMP INPUT'!I10<0.4,0.4,'BMP INPUT'!I10)","v":0.4},0,0]
[null,"Dry Well",null,"#3",{"$f":"'BMP INPUT'!I18","v":0},{"$f":"'BMP INPUT'!I21","v":0},6,{"$f":"IF('BMP INPUT'!I17<0.4,0.4,'BMP INPUT'!I17)","v":0.4},0,0]
[null,"Bioswale",null,"#1",{"$f":"'BMP INPUT'!L4*'BMP INPUT'!L7","v":0},{"$f":"'BMP INPUT'!L8","v":0},6,{"$f":"IF('BMP INPUT'!L3<0.4,0.4,'BMP INPUT'!L3)","v":0.4},0,0]
[null,"Bioswale",null,"#2",{"$f":"'BMP INPUT'!L12*'BMP INPUT'!L15","v":0},{"$f":"'BMP INPUT'!L16","v":0},6,{"$f":"IF('BMP INPUT'!L11<0.4,0.4,'BMP INPUT'!L11)","v":0.4},0,0]
{"$rows_left_out":6}
{"sheet":"REF_Curve Numbers","index":7,"n_rows":43,"n_cols":3,"rows_kept":43,"cut":false,"hidden":false,"merged":[[0,0,0,1]]}
["Curve Numbers"]
[]
["Impervious Cover (pavement/gravel/rooftop)",98]
["Open Water (detention pond footprint)",100]
["Pasture/Grasslands (Type A)",42,"(revised to CN=42 --> minimum CN allowed is 42)"]
["Pasture/Grasslands (Type B)",61]
["Pasture/Grasslands (Type C)",74]
["Meadow (Type A)",42,"(revised to CN=42 --> minimum CN allowed is 42)"]
["Meadow (Type B)",58]
["Meadow (Type C)",71]
["Brush (Type A)",42,"(revised to CN=42 --> minimum CN allowed is 42)"]
["Brush (Type B)",48]
["Brush (Type C)",65]
["Woods (Type A)",42,"(revised to CN=42 --> minimum CN allowed is 42)"]
["Woods (Type B)",58]
{"$rows_left_out":29}
{"sheet":"REF_Runoff Coefficients","index":8,"n_rows":43,"n_cols":2,"rows_kept":43,"cut":false,"hidden":false,"merged":[[0,0,0,1]]}
["Runoff Coefficients"]
[]
["Impervious Cover (pavement/gravel/rooftop)",0.9]
["Open Water (detention pond footprint)",1]
["Pasture/Grasslands (Type A)",0.1]
["Pasture/Grasslands (Type B)",0.15]
["Pasture/Grasslands (Type C)",0.2]
["Meadow (Type A)",0.1]
["Meadow (Type B)",0.15]
["Meadow (Type C)",0.2]
["Brush (Type A)",0.1]
["Brush (Type B)",0.15]
["Brush (Type C)",0.2]
["Woods (Type A)",0.1]
["Woods (Type B)",0.15]
{"$rows_left_out":29}
{"sheet":"REF_Time of Concentration","index":9,"n_rows":5,"n_cols":2,"rows_kept":5,"cut":false,"hidden":false,"merged":[[0,0,0,1]]}
["Segment Description"]
[]
["Sheet Flow",0.48]
["Waterway",1.2]
["Small Tributary",2.1]